{"text_format":"1","workbook":"xlsx","n_sheets":3,"sheets":["Teileliste","Material","Kanten"],"not_rendered":{"charts":0,"images":9,"macros":1,"external_links":0,"defined_names":1,"comments":0,"pivot_tables":0},"unopened":[],"bounds":{"document_bytes":16777216,"sheet_cells":100000,"rows_first":2000,"rows_last":500,"rows_between":2000,"halvings":0,"cell_chars":16384,"cell_head_chars":4096},"cells_cut":0,"cells_raw":0,"read":"whole","date_system":"1900"}

{"sheet":"Teileliste","index":0,"n_rows":63,"n_cols":16,"rows_kept":63,"cut":false,"hidden":false,"merged":[[37,1,38,1],[37,2,38,2],[37,3,38,3],[37,7,38,7],[3,10,3,14],[60,3,60,12],[13,10,13,14],[15,10,15,14],[6,2,6,5],[37,8,37,14],[37,5,37,6]]}
[]
[]
[null,"Teileliste"]
[null,"Für Plattenzuschnitte und Kantenumleimung"]
[]
[]
[]
[]
[]
[]
[]
[null,"Kontaktdaten",null,null,null,null,null,null,"Weitere Angaben"]
[null,"Bitte füllen Sie die nachstehenden Felder mit Ihren Kontaktdaten.",null,null,null,null,null,null,"Bitte wählen Sie nachstehend die passenden Antwortmöglichkeiten aus."]
[]
[null,null,"Kd.-Nr.: "]
[null,null,"(Firmen)-Name: "]
[null,null,"Straße: "]
[null,null,"PLZ-Ort: "]
[null,null,"Telefon: "]
[null,null,"Ansprechpartner/in: "]
[null,null,"Ihre Referenz: "]
[null,null,"Gewünschtes Lieferdatum: ","2023-05-10"]
[]
[null,"Vertriebsinformationen",null,null,null,null,null,null,"Bearbeitungsoptionen"]
[null,"Nachstehende Felder werden durch den Verkäufer / die Verkäuferin befüllt.",null,null,null,null,null,null,"Nachstehende Felder werden vom Verkäufer / von der Verkäuferin genutzt."]
[]
[null,null,"AN/AT-Nr.:"]
[null,null,"Verkäufer/in:"]
[]
[]
[null,"Zuschnittsdaten"]
[null,"Bitte geben Sie nachstehend die gewünschten Zuschnittsdaten ein."]
[null,"Bitte beachten Sie, dass die Umleimung standardmäßig zunächst an der Quer- und dann an der Längskante erfolgt."]
[null,"Wünschen Sie eine abweichende Reihenfolge, dann teilen Sie uns diese bitte mit."]
[null,"Bitte nehmen Sie darüber hinaus zur Kenntnis, dass die Maserrichtung immer in Längsrichtung verläuft (siehe Grafik)."]
[null,"Bitte senden Sie das ausgefüllte Dokument per E-Mail an optimierung@haupthoff.de"]
[]
[null,"Pos.","Bezeichnung","Material",null,"Maße [mm]",null,"Menge","Kanten"]
[null,null,null,null,"Material","Länge","Breite",null,"Längskante vorne","Längskante vorne","Längskante hinten","Längskante hinten","Querkante links","Querkante links","Querkante rechts","Querkante rechts"]
[null,1,null,"",{"$f":"IFERROR(VLOOKUP(D40,Material!$A:$B,2,FALSE),\"\")","v":""},null,null,null,"",{"$f":"IFERROR(VLOOKUP(I40,Kanten!A:B,2,FALSE),\"\")","v":""},"",{"$f":"IFERROR(VLOOKUP(K40,Kanten!C:D,2,FALSE),\"\")","v":""},"",{"$f":"IFERROR(VLOOKUP(M40,Kanten!E:F,2,FALSE),\"\")","v":""},"",{"$f":"IFERROR(VLOOKUP(O40,Kanten!G:H,2,FALSE),\"\")","v":""}]
[null,2,null,"",{"$f":"IFERROR(VLOOKUP(D41,Material!$A:$B,2,FALSE),\"\")","v":""},null,null,null,"",{"$f":"IFERROR(VLOOKUP(I41,#REF!,2,FALSE),\"\")","v":""},"",{"$f":"IFERROR(VLOOKUP(K41,#REF!,2,FALSE),\"\")","v":""},"",{"$f":"IFERROR(VLOOKUP(M41,#REF!,2,FALSE),\"\")","v":""},"",{"$f":"IFERROR(VLOOKUP(O41,#REF!,2,FALSE),\"\")","v":""}]
[null,3,null,"",{"$f":"IFERROR(VLOOKUP(D42,Material!$A:$B,2,FALSE),\"\")","v":""},null,null,null,"",{"$f":"IFERROR(VLOOKUP(I42,#REF!,2,FALSE),\"\")","v":""},"",{"$f":"IFERROR(VLOOKUP(K42,#REF!,2,FALSE),\"\")","v":""},"",{"$f":"IFERROR(VLOOKUP(M42,#REF!,2,FALSE),\"\")","v":""},"",{"$f":"IFERROR(VLOOKUP(O42,#REF!,2,FALSE),\"\")","v":""}]
[null,4,null,"",{"$f":"IFERROR(VLOOKUP(D43,Material!$A:$B,2,FALSE),\"\")","v":""},null,null,null,"",{"$f":"IFERROR(VLOOKUP(I43,#REF!,2,FALSE),\"\")","v":""},"",{"$f":"IFERROR(VLOOKUP(K43,#REF!,2,FALSE),\"\")","v":""},"",{"$f":"IFERROR(VLOOKUP(M43,#REF!,2,FALSE),\"\")","v":""},"",{"$f":"IFERROR(VLOOKUP(O43,#REF!,2,FALSE),\"\")","v":""}]
[null,5,null,"",{"$f":"IFERROR(VLOOKUP(D44,Material!$A:$B,2,FALSE),\"\")","v":""},null,null,null,"",{"$f":"IFERROR(VLOOKUP(I44,#REF!,2,FALSE),\"\")","v":""},"",{"$f":"IFERROR(VLOOKUP(K44,#REF!,2,FALSE),\"\")","v":""},"",{"$f":"IFERROR(VLOOKUP(M44,#REF!,2,FALSE),\"\")","v":""},"",{"$f":"IFERROR(VLOOKUP(O44,#REF!,2,FALSE),\"\")","v":""}]
[null,6,null,null,{"$f":"IFERROR(VLOOKUP(D45,Material!$A:$B,2,FALSE),\"\")","v":""},null,null,null,"",{"$f":"IFERROR(VLOOKUP(I45,#REF!,2,FALSE),\"\")","v":""},"",{"$f":"IFERROR(VLOOKUP(K45,#REF!,2,FALSE),\"\")","v":""},"",{"$f":"IFERROR(VLOOKUP(M45,#REF!,2,FALSE),\"\")","v":""},"",{"$f":"IFERROR(VLOOKUP(O45,#REF!,2,FALSE),\"\")","v":""}]
[null,7,null,null,{"$f":"IFERROR(VLOOKUP(D46,Material!$A:$B,2,FALSE),\"\")","v":""},null,null,null,"",{"$f":"IFERROR(VLOOKUP(I46,#REF!,2,FALSE),\"\")","v":""},"",{"$f":"IFERROR(VLOOKUP(K46,#REF!,2,FALSE),\"\")","v":""},"",{"$f":"IFERROR(VLOOKUP(M46,#REF!,2,FALSE),\"\")","v":""},"",{"$f":"IFERROR(VLOOKUP(O46,#REF!,2,FALSE),\"\")","v":""}]
[null,8,null,"",{"$f":"IFERROR(VLOOKUP(D47,Material!$A:$B,2,FALSE),\"\")","v":""},null,null,null,"",{"$f":"IFERROR(VLOOKUP(I47,#REF!,2,FALSE),\"\")","v":""},"",{"$f":"IFERROR(VLOOKUP(K47,#REF!,2,FALSE),\"\")","v":""},"",{"$f":"IFERROR(VLOOKUP(M47,#REF!,2,FALSE),\"\")","v":""},"",{"$f":"IFERROR(VLOOKUP(O47,#REF!,2,FALSE),\"\")","v":""}]
[null,9,null,null,{"$f":"IFERROR(VLOOKUP(D48,Material!$A:$B,2,FALSE),\"\")","v":""},null,null,null,"",{"$f":"IFERROR(VLOOKUP(I48,#REF!,2,FALSE),\"\")","v":""},"",{"$f":"IFERROR(VLOOKUP(K48,#REF!,2,FALSE),\"\")","v":""},"",{"$f":"IFERROR(VLOOKUP(M48,#REF!,2,FALSE),\"\")","v":""},"",{"$f":"IFERROR(VLOOKUP(O48,#REF!,2,FALSE),\"\")","v":""}]
[null,10,null,null,{"$f":"IFERROR(VLOOKUP(D49,Material!$A:$B,2,FALSE),\"\")","v":""},null,null,null,"",{"$f":"IFERROR(VLOOKUP(I49,#REF!,2,FALSE),\"\")","v":""},"",{"$f":"IFERROR(VLOOKUP(K49,#REF!,2,FALSE),\"\")","v":""},"",{"$f":"IFERROR(VLOOKUP(M49,#REF!,2,FALSE),\"\")","v":""},"",{"$f":"IFERROR(VLOOKUP(O49,#REF!,2,FALSE),\"\")","v":""}]
[null,11,null,null,{"$f":"IFERROR(VLOOKUP(D50,Material!$A:$B,2,FALSE),\"\")","v":""},null,null,null,"",{"$f":"IFERROR(VLOOKUP(I50,#REF!,2,FALSE),\"\")","v":""},"",{"$f":"IFERROR(VLOOKUP(K50,#REF!,2,FALSE),\"\")","v":""},"",{"$f":"IFERROR(VLOOKUP(M50,#REF!,2,FALSE),\"\")","v":""},"",{"$f":"IFERROR(VLOOKUP(O50,#REF!,2,FALSE),\"\")","v":""}]
[null,12,null,null,{"$f":"IFERROR(VLOOKUP(D51,Material!$A:$B,2,FALSE),\"\")","v":""},null,null,null,"",{"$f":"IFERROR(VLOOKUP(I51,#REF!,2,FALSE),\"\")","v":""},"",{"$f":"IFERROR(VLOOKUP(K51,#REF!,2,FALSE),\"\")","v":""},"",{"$f":"IFERROR(VLOOKUP(M51,#REF!,2,FALSE),\"\")","v":""},"",{"$f":"IFERROR(VLOOKUP(O51,#REF!,2,FALSE),\"\")","v":""}]
[null,13,null,null,{"$f":"IFERROR(VLOOKUP(D52,Material!$A:$B,2,FALSE),\"\")","v":""},null,null,null,"",{"$f":"IFERROR(VLOOKUP(I52,#REF!,2,FALSE),\"\")","v":""},"",{"$f":"IFERROR(VLOOKUP(K52,#REF!,2,FALSE),\"\")","v":""},"",{"$f":"IFERROR(VLOOKUP(M52,#REF!,2,FALSE),\"\")","v":""},"",{"$f":"IFERROR(VLOOKUP(O52,#REF!,2,FALSE),\"\")","v":""}]
[null,14,null,null,{"$f":"IFERROR(VLOOKUP(D53,Material!$A:$B,2,FALSE),\"\")","v":""},null,null,null,"",{"$f":"IFERROR(VLOOKUP(I53,#REF!,2,FALSE),\"\")","v":""},"",{"$f":"IFERROR(VLOOKUP(K53,#REF!,2,FALSE),\"\")","v":""},"",{"$f":"IFERROR(VLOOKUP(M53,#REF!,2,FALSE),\"\")","v":""},"",{"$f":"IFERROR(VLOOKUP(O53,#REF!,2,FALSE),\"\")","v":""}]
[null,15,null,null,{"$f":"IFERROR(VLOOKUP(D54,Material!$A:$B,2,FALSE),\"\")","v":""},null,null,null,"",{"$f":"IFERROR(VLOOKUP(I54,#REF!,2,FALSE),\"\")","v":""},"",{"$f":"IFERROR(VLOOKUP(K54,#REF!,2,FALSE),\"\")","v":""},"",{"$f":"IFERROR(VLOOKUP(M54,#REF!,2,FALSE),\"\")","v":""},"",{"$f":"IFERROR(VLOOKUP(O54,#REF!,2,FALSE),\"\")","v":""}]
[null,16,null,null,{"$f":"IFERROR(VLOOKUP(D55,Material!$A:$B,2,FALSE),\"\")","v":""},null,null,null,"",{"$f":"IFERROR(VLOOKUP(I55,#REF!,2,FALSE),\"\")","v":""},"",{"$f":"IFERROR(VLOOKUP(K55,#REF!,2,FALSE),\"\")","v":""},"",{"$f":"IFERROR(VLOOKUP(M55,#REF!,2,FALSE),\"\")","v":""},"",{"$f":"IFERROR(VLOOKUP(O55,#REF!,2,FALSE),\"\")","v":""}]
[null,17,null,null,{"$f":"IFERROR(VLOOKUP(D56,Material!$A:$B,2,FALSE),\"\")","v":""},null,null,null,"",{"$f":"IFERROR(VLOOKUP(I56,#REF!,2,FALSE),\"\")","v":""},"",{"$f":"IFERROR(VLOOKUP(K56,#REF!,2,FALSE),\"\")","v":""},"",{"$f":"IFERROR(VLOOKUP(M56,#REF!,2,FALSE),\"\")","v":""},"",{"$f":"IFERROR(VLOOKUP(O56,#REF!,2,FALSE),\"\")","v":""}]
[null,18,null,null,{"$f":"IFERROR(VLOOKUP(D57,Material!$A:$B,2,FALSE),\"\")","v":""},null,null,null,"",{"$f":"IFERROR(VLOOKUP(I57,#REF!,2,FALSE),\"\")","v":""},"",{"$f":"IFERROR(VLOOKUP(K57,#REF!,2,FALSE),\"\")","v":""},"",{"$f":"IFERROR(VLOOKUP(M57,#REF!,2,FALSE),\"\")","v":""},"",{"$f":"IFERROR(VLOOKUP(O57,#REF!,2,FALSE),\"\")","v":""}]
[null,19,null,null,{"$f":"IFERROR(VLOOKUP(D58,Material!$A:$B,2,FALSE),\"\")","v":""},null,null,null,"",{"$f":"IFERROR(VLOOKUP(I58,#REF!,2,FALSE),\"\")","v":""},"",{"$f":"IFERROR(VLOOKUP(K58,#REF!,2,FALSE),\"\")","v":""},"",{"$f":"IFERROR(VLOOKUP(M58,#REF!,2,FALSE),\"\")","v":""},"",{"$f":"IFERROR(VLOOKUP(O58,#REF!,2,FALSE),\"\")","v":""}]
[null,20,null,null,{"$f":"IFERROR(VLOOKUP(D59,Material!$A:$B,2,FALSE),\"\")","v":""},null,null,null,"",{"$f":"IFERROR(VLOOKUP(I59,#REF!,2,FALSE),\"\")","v":""},"",{"$f":"IFERROR(VLOOKUP(K59,#REF!,2,FALSE),\"\")","v":""},"",{"$f":"IFERROR(VLOOKUP(M59,#REF!,2,FALSE),\"\")","v":""},"",{"$f":"IFERROR(VLOOKUP(O59,#REF!,2,FALSE),\"\")","v":""}]
[]
[null,null,null,"Haupthoff Baufachzentrum - Egon Haupthoff GmbH & Co. KG - Juliankadamm 20 - 25524 Heiligenstedten - Tel.: 04821 / 175-0 - Fax: 04821 / 175-400 - www.haupthoff.de"]
[]
[null,null,null,null,null,null,null,null,"Vertraulich & urheberrechtlich geschützt"]

{"sheet":"Material","index":1,"n_rows":186,"n_cols":2,"rows_kept":186,"cut":false,"hidden":true,"merged":[]}
["Beschreibung","Materialcode"]
["Sprela Arbeitsplatte Postforming K205 Black Concrete RS, U-Profil","APL_38_900_205_DEFEKT_HL"]
["Sprela Arbeitsplatte Postforming K205 Black Concrete RS, U-Profil","APL_38_635_BLACK_CONCRETE_K205"]
["Sprela Arbeitsplatte Postforming K367 Cream Navona PH, U-Profil","APL_38_900_CREAM_NAVONA_K367"]
["Sprela Arbeitsplatte Postforming K201 Dark Grey Concrete RS, U-Profil","APL_38_635_DARK_GREY_CONCRETE_K201"]
["Sprela Arbeitsplatte Postforming K201 Dark Grey Concrete RS, U-Profil","APL_38_900_DARK_GREY_CONCRETE_K201"]
["Sprela Arbeitsplatte Postforming K092 Dark Porterhouse Oak FP, U-Profil","APL_38_635_DARK_PORTERHOUSE_OAK_K092"]
["Sprela Arbeitsplatte Postforming K092 Dark Porterhouse Oak FP, U-Profil","APL_38_900_DARK_PORTERHOUSE_OAK_K092"]
["Arbeitsplatte AF 40/113 DIG D2106POD Cottage Planks","APL_38_DIG2106_COTTAGE_PLANKS"]
["Sprela Arbeitsplatte Postforming K107 Elegance Endgrain Oak FP, U-Profil","APL_38_635_ELEGANCE_ENDGRAIN_OAK_K107"]
["Sprela Arbeitsplatte Postforming K107 Elegance Endgrain Oak FP, U-Profil","APL_38_900_ELEGANCE_ENDGRAIN_OAK_K107"]
["Sprela Arbeitsplatte Postforming K368 Grey Atlantic Marble PH, U-Profil","APL_38_635_GREY_ATLANTIC_MARBLE_K368"]
["Sprela Arbeitsplatte Postforming K368 Grey Atlantic Marble PH, U-Profil","APL_38_900_GREY_ATLANTIC_MARBLE_K368"]
["Sprela Arbeitsplatte Postforming 4298 Light Atelier UE, U-Profil","APL_38_635_LIGHT_ATELIER_4298"]
["Sprela Arbeitsplatte Postforming 4298 Light Atelier UE, U-Profil","APL_38_900_LIGHT_ATELIER_4298"]
["Sprela Arbeitsplatte Postforming K091 Light Porterhouse Oak FP, U-Profil","APL_38_635_LIGHT_PORTERHOUSE_OAK_K091"]
["Sprela Arbeitsplatte Postforming K091 Light Porterhouse Oak FP, U-Profil","APL_38_900_LIGHT_PORTERHOUSE_OAK_K091"]
["Sprela Arbeitsplatte Postforming K028 Portland SU, U-Profil","APL_38_635_PORTLAND_K028"]
["Sprela Arbeitsplatte Postforming K028 Portland SU, U-Profil","APL_38_900_PORTLAND_K028"]
["Sprela Arbeitsplatte Postforming K013 Sand Artisan Beech RS, U-Profil","APL_38_900_SAND_ARTISAN_BEECH_K013"]
["Sprela Arbeitsplatte Postforming K013 Sand Artisan Beech RS, U-Profil","APL_38_635_SAND_ARTISAN_BEECH_K013"]
["Sprela Arbeitsplatte Postforming A300 Sirius Black RS, U-Profil","APL_38_635_SIRIUS_BLACK_A300"]
["Sprela Arbeitsplatte Postforming A300 Sirius Black, U-Profil","APL_38_900_SIRIUS_BLACK_A300"]
["Sprela Arbeitsplatte Postforming 8685 Snow White RS, U-Profil","APL_38_635_SNOW_WHITE_8685"]
["Sprela Arbeitsplatte Postforming 8685 Snow White RS, U-Profil","APL_38_900_SNOW_WHITE_8685"]
["Sprela Arbeitsplatte Postforming 3025 Sonoma Eiche WO, U-Profil","APL_38_635_SONOMA_EICHE_3025"]
["Sprela Arbeitsplatte Postforming 8197 Sonoma Eiche WO, U-Profil","APL_38_900_SONOMA_EICHE_3025"]
["Sprela Arbeitsplatte Postforming A204 Stone Black CR, U-Profil","APL_38_900_STONE_BLACK_A204"]
["Finn. Fichtenbaufurniersperrholz nach DIN 68705 T.3 3-PLUS, BFU 100","BFU_21_FICHTE"]
["Rauvisio Crystal composite Glaspanel auf MDF-Träger, V2778 Bianco high gloss","CRYSTAL_RAUVISIO_BIANCO_HGL"]
["Rauvisio Crystal slim Glaspanel V2778 Bianco high gloss","CRYSTAL_SLIM_BIANCO_HGL"]
["Rauvisio Crystal slim Glaspanel 1696L Bianco matt","CRYSTAL_SLIM_BIANCO_MATT"]
["Rauvisio Crystal slim Glaspanel 1686L Fumo high gloss","CRYSTAL_SLIM_FUMO_HGL"]
["Rauvisio Crystal slim Glaspanel V2892 Perla high gloss","CRYSTAL_SLIM_PERLA_HGL"]
["Rauvisio Crystal slim Glaspanel 1697L Perla matt","CRYSTAL_SLIM_PERLA_MATT"]
["Rauvisio Crystal slim Glaspanel 1687L Sabbia high gloss","CRYSTAL_SLIM_SABBIA_HGL"]
["Deglas XT farblos 70000 extrudiertes Acrylglas- entspricht Röhm Farbe 0A00","DEGLAS_XT_10_FARBLOS"]
["Deglas XT farblos 70000 extrudiertes Acrylglas- entspricht Röhm Farbe 0A00","DEGLAS_XT_3_FARBLOS"]
["Deglas XT farblos 70000 extrudiertes Acrylglas- entspricht Röhm Farbe 0A00","DEGLAS_XT_6_FARBLOS"]
["Alu-Verbundplatte Dibond weiß 0,3 mm Deckschicht","DIBOND_3_WEISS"]
["Alu-Verbundplatte Dibond weiß 0,3 mm Deckschicht","DIBOND_4_WEISS"]
["Krono Dekorspanplatte P2 0101 Front White Pearl (PE)","DSP_10_FRONT_WHITE_0101_PE"]
["Krono Dekorspanplatte P2 8685 Snow White Bureau Structure (BS)","DSP_10_SNOW_WHITE_8685_BS"]
["Krono Dekorspanplatte P2 0101 Front White Pearl (PE)","DSP_16_FRONT_WHITE_0101_PE"]
["Krono Dekorspanplatte P2 8685 Snow White Bureau Structure (BS)","DSP_16_SNOW_WHITE_8685_BS"]
["Krono Dekorspanplatte P2 8100 Pearl White Silk Matt (SM)","DSP_16_WHITE_8100_SM"]
["Krono Dekorspanplatte P2 0881 Aluminium Perlstruktur (PE)","DSP_19_ALUMINIUM_0881_PE"]
["Krono Dekorspanplatte P2 0164 Anthracite Perlstruktur (PE)","DSP_19_ANTHRACITE_0164_PE"]
["Krono Dekorspanplatte P2 0381 Bavaria Beech Wood Pore (PR)","DSP_19_BAVARIA_BEECH_0381_PR"]
["Krono Dekorspanplatte P2 0391 Beacon Beech Wood Pore (PR)","DSP_19_BEACON_BEECH_0391_PR"]
["Krono Dekorspanplatte P2 0190 Black Perlstruktur (PE)","DSP_19_BLACK_0190_PE"]
["Krono Dekorspanplatte P2 K353 Charcoal Flow Rust (RT)","DSP_19_CHARCOAL_FLOW_K353_RT"]
["Krono Dekorspanplatte P2 K096 Clay Grey Super Matt (SU)","DSP_19_CLAY_GREY_K096_SU"]
["Krono Dekorspanplatte P2 K365 Coast Evoke Oak Pure Wood (PW)","DSP_19_COAST_EVOKE_OAK_K365_PW"]
["Krono Dekorspanplatte P2 K350 Concrete Flow Rust (RT)","DSP_19_CONCRETE_FLOW_K350_RT"]
["Krono Dekorspanplatte P2 0191 Cool Grey Super Matt (SU)","DSP_19_COOL_GREY_0191_SU"]
["Krono Dekorspanplatte P2 7031 Creme Bureau Structure (BS)","DSP_19_CREME_7031_BS"]
["Krono Dekorspanplatte P2 K009 Dark Select Walnut Pure Wood (PW)","DSP_19_DARK_SELECT_WALNUT_K009_PW"]
["Krono Dekorspanplatte P2 K362 Espresso Harbor Oak Pure Wood (PW)","DSP_19_ESPRESSO_HARBOR_OAK_K362_PW"]
["Krono Dekorspanplatte P2 K366 Fossil Evoke Oak Pure Wood (PW)","DSP_19_FOSSIL_EVOKE_OAK_K366_PW"]
["Krono Dekorspanplatte P2 0101 Front White Pearl (PE)","DSP_19_FRONT_WHITE_0101_PE"]
["Krono Dekorspanplatte P2 0162 Graphit Grey Pearl (PE)","DSP_19_GRAPHIT_GREY_0162_PE"]
["Krono Dekorspanplatte P2 K002 Grey Craft Oak Pure Wood (PW)","DSP_19_GREY_CRAFT_OAK_K002_PW"]
["Krono Dekorspanplatte P2 K358 Honey Castello Oak Pure Wood (PW)","DSP_19_HONEY_CASTELLO_OAK_K358_PW"]
["Krono Dekorspanplatte P2 3025 Light Sonoma Oak Super Natural (SN)","DSP_19_LIGHT_SONOMA_OAK_3025_SN"]
["Krono Dekorspanplatte P2 0375 Maple Wood Pore (PR)","DSP_19_MAPLE_0375_PR"]
["Krono Dekorspanplatte P2 K363 Natural Aurora Elm Pure Wood (PW)","DSP_19_NATURAL_AURORA_ELM_K363_PW"]
["Krono Dekorspanplatte P2 K086 Natural Rockford Hickory Pure Wood (PW)","DSP_19_NATURAL_ROCKFORD_HICKORY_K086_PW"]
["Krono Dekorspanplatte P2 0859 Platinum Pearl (PE)","DSP_19_PLATINUM_0859_PE"]
["Krono Dekorspanplatte P2 K351 Rusty Flow Rust (RT)","DSP_19_RUSTY_FLOW_K351_RT"]
["Krono Dekorspanplatte P2 K022 Satin Blackwood Super Natural (SN)","DSP_19_SATIN_BLACKWOOD_K022_SN"]
["Krono Dekorspanplatte P2 K349 Silk Flow Rust (RT)","DSP_19_SILK_FLOW_K349_RT"]
["Krono Dekorspanplatte P2 0171 Slate Grey Pearl (PE)","DSP_19_SLATE_GREY_0171_PE"]
["Krono Dekorspanplatte P2 8685 Snow White Bureau Structure (BS)","DSP_19_SNOW_WHITE_8685_BS"]
["Krono Dekorspanplatte P2 0112 Stone Grey Pearl (PE)","DSP_19_STONE_GREY_0112_PE"]
["Krono Dekorspanplatte P2 8508 White North Wood Super Natural (SN)","DSP_19_WHITE_NORTH_WOOD_8508_SN"]
["Krono Dekorspanplatte P2 8100 Pearl White Silk Matt (SM)","DSP_19_WHITE_8100_SM"]
["Krono Dekorspanplatte P2 0101 Front White Pearl (PE)","DSP_22_FRONT_WHITE_0101_PE"]
["Krono Dekorspanplatte P2 8685 Snow White Bureau Structure (BS)","DSP_22_SNOW_WHITE_8685_BS"]
["Krono Dekorspanplatte P2 8100 Pearl White Silk Matt (SM)","DSP_22_WHITE_8100_SM"]
["Krono Dekorspanplatte P2 0101 Front White Pearl (PE)","DSP_25_FRONT_WHITE_0101_PE"]
["Krono Dekorspanplatte P2 8685 Snow White Bureau Structure (BS)","DSP_25_SNOW_WHITE_8685_BS"]
["Krono Dekorspanplatte P2 0101 Front White Pearl (PE)","DSP_28_FRONT_WHITE_0101_PE"]
["Krono Dekorspanplatte P2 8685 Snow White Bureau Structure (BS)","DSP_38_SNOW_WHITE_8685_BS"]
["Krono Dekorspanplatte P2 0101 Front White Pearl (PE)","DSP_8_FRONT_WHITE_0101_PE"]
["Krono Dekorspanplatte P2 8685 Snow White Bureau Structure (BS)","DSP_8_SNOW_WHITE_8685_BS"]
["DURACOM® Compactplatte CGS (B2) Dekor 7502 / anthrazitgrau","DURACOM_BP_6_ANTHR"]
["DURACOM® Compactplatte CGS (B2) Dekor 0603 / weiß","DURACOM_BP_6_WEISS"]
["Egger Dekorspanplatte W1100 ST30 alpinweiß","EGGER_DSP_W1100_HOCHGLANZ"]
["Film/Film-Platten durchgängig Pappel","FFP_21"]
["Film/Film-Platten durchgängig Pappel","FFP_4"]
["Fichten Drei-Schichtplatten Verleimung AW100  - Qualität A/B","FICHTE_3-SCHICHT_19"]
["Fichten Drei-Schichtplatten Verleimung AW100  - Qualität B/C+","FICHTE_3-SCHICHT_27"]
["Film/Siebdruck Karosseriebauplatte Birke BFU 100","FSP_KB_12"]
["Film/Siebdruck Karosseriebauplatte Birke BFU 100","FSP_KB_15"]
["Film/Siebdruck Karosseriebauplatte Birke BFU 100","FSP_KB_18"]
["Film/Siebdruck Karosseriebauplatte Birke BFU 100","FSP_KB_21"]
["Film/Siebdruck Karosseriebauplatte Birke BFU 100","FSP_KB_21"]
["Film/Siebdruck Karosseriebauplatte Birke BFU 100","FSP_KB_24"]
["Film/Siebdruck Karosseriebauplatte Birke BFU 100","FSP_KB_9"]
["Film/Siebdruck Karosseriebauplatte Birke BFU 100","FSP_KB_9"]
["Gabun Tischlerplatte IF-Verleimung Stab-3-Fach","GABUN_TP_16"]
["Gabun Tischlerplatte IF-Verleimung Stab-3-Fach","GABUN_TP_19"]
["Hartfaserplatten Braun","HFP_3.2_BRAUN"]
["Homadur weiß einseitig HDF U0115","HOM_3_WEISS"]
["Homadur weiß einseitig HDF U0115","HOM_5_WEISS"]
["Innovus Dekorspanplatte M2197 Cendre Oak","INNO_DSP_19_CENDRE_OAK"]
["Innovus Dekorspanplatte F2204 Natural Concrete","INNO_DSP_19_NATURAL_CONCRETE"]
["Innovus Dekorspanplatte M6220 Stockholm Pine","INNO_DSP_19_STOCKHOLM_PINE"]
["Koemacel Integralschaumplatte weiß 652","ISP_10_WEISS"]
["Buche Leimholzmassivplatte gehobelte, keilgezinkte Lamellen geschliffen","LHP_18_BUCHE"]
["Kiefer Leimholzmassivplatte gehobelte, durchgehende Lamellen geschliffen","LHP_18_Kiefer"]
["Buche Leimholzmassivplatte gehobelte, keilgezinkte Lamellen geschliffen","LHP_19_BUCHE"]
["Eiche Leimholzmassivplatte keilgezinkte Lamellen Verleimung D3","LHP_19_EICHE"]
["Buche Leimholzmassivplatte gehobelte, keilgezinkte Lamellen geschliffen","LHP_27_BUCHE"]
["Eiche Leimholzmassivplatte keilgezinkte Lamellen Verleimung D3","LHP_27_EICHE"]
["Kiefer Leimholzmassivplatte gehobelte, durchgehende Lamellen geschliffen","LHP_27_Kiefer"]
["Buche Leimholzmassivplatte leicht gedämpft keilgezinkte Lamellen Verleimung D3","LHP_40_BUCHE"]
["Buche Leimholzmassivplatte leicht gedämpft keilgezinkte Lamellen Verleimung D3","LHP_40_BUCHE"]
["Eiche Leimholzmassivplatte keilgezinkte Lamellen Verleimung D3","LHP_40_EICHE"]
{"$rows_left_out":67}
{"sheet":"Kanten","index":2,"n_rows":14,"n_cols":2,"rows_kept":14,"cut":false,"hidden":true,"merged":[]}
["Beschreibung","Kante"]
["ABS 2x23 für B3002 Spezialweiß","ABS_2_23_WEIß_MINIPERL"]
["ABS 2x28 für B3002 Spezialweiß (22mm)","ABS_2_28_WEIß_MINIPERL"]
["Längskante einseitig ABS-Kante abgerundet","ABS_23_KANTE_BRÜSTUNG"]
["ABS 2x23 Dekorgleich Uni","ABS_2_23_DEKORGLEICH_UNI"]
["ABS 2x23 Dekorgleich Holz","ABS_2_23_DEKORGLEICH_HOLZ"]
["Starkfurnier 2x24 Birke","STARKFURNIER_2_24_BIRKE"]
["Starkfurnier 2x24 Buche","STARKFURNIER_2_24_BUCHE"]
["Starkfurnier 2x24 Eiche","STARKFURNIER_2_24_EICHE"]
["Starkfurnier 2x24 Kiefer","STARKFURNIER_2_24_KIEFER"]
["ABS 2 x 23 für 8685 Snow White","ABS_2_23_SNOW_WHITE"]
["ABS 2 x 28 für 8685 Snow White","ABS_2_28_SNOW_WHITE"]
["ABS 2 x 23 für 8100 Pearl White Silk Matt","ABS_2_23_PEARL_WHITE_SILK_MATT"]
["ABS 2 x 23 für 0112 Stone Grey","ABS_2_23_STONE_GREY"]